Ticket #658: log.txt

File log.txt, 18.6 KB (added by stranche@…, 12 years ago)

result of make

Line 
1make -C libvo libvo.a
2make[1]: `libvo.a' is up to date.
3make -C libao2
4make[1]: Nothing to be done for `all'.
5make -C input
6make[1]: Nothing to be done for `all'.
7make -C libmpcodecs
8make[1]: Nothing to be done for `all'.
9make -C libaf
10make[1]: Nothing to be done for `all'.
11make -C libmpdemux libmpdemux.a
12cc -c -I.. -I../stream -I../loader -I../libavutil -I../libavcodec -I../libavformat -I. -I.. -Wdeclaration-after-statement -O4 -march=pentium-m -mtune=pentium-m -pipe -ffast-math -fomit-frame-pointer -mdynamic-no-pic -falign-loops=16 -DSYS_DARWIN -DCONFIG_DARWIN -shared-libgcc -arch i386 -isysroot /Developer/SDKs/MacOSX10.4u.sdk -D_LARGEFILE_SOURCE -D_FILE_OFFSET_BITS=64 -D_LARGEFILE64_SOURCE -I/usr/X11R6/include -o demux_mov.o demux_mov.c
13In file included from /Developer/SDKs/MacOSX10.4u.sdk/System/Library/Frameworks/CoreFoundation.framework/Headers/CoreFoundation.h:38,
14                 from /Developer/SDKs/MacOSX10.4u.sdk/System/Library/Frameworks/CoreServices.framework/Frameworks/CarbonCore.framework/Headers/CarbonCore.h:20,
15                 from /Developer/SDKs/MacOSX10.4u.sdk/System/Library/Frameworks/CoreServices.framework/Headers/CoreServices.h:21,
16                 from /Developer/SDKs/MacOSX10.4u.sdk/System/Library/Frameworks/Carbon.framework/Headers/Carbon.h:20,
17                 from /Developer/SDKs/MacOSX10.4u.sdk/System/Library/Frameworks/QuickTime.framework/Headers/QuickTime.h:20,
18                 from demux_mov.c:42:
19/Developer/SDKs/MacOSX10.4u.sdk/System/Library/Frameworks/CoreFoundation.framework/Headers/CFBase.h:195: error: parse error before '__attribute__'
20/Developer/SDKs/MacOSX10.4u.sdk/System/Library/Frameworks/CoreFoundation.framework/Headers/CFBase.h:195: error: parse error before ')' token
21In file included from /Developer/SDKs/MacOSX10.4u.sdk/System/Library/Frameworks/CoreFoundation.framework/Headers/CFPropertyList.h:10,
22                 from /Developer/SDKs/MacOSX10.4u.sdk/System/Library/Frameworks/CoreFoundation.framework/Headers/CoreFoundation.h:46,
23                 from /Developer/SDKs/MacOSX10.4u.sdk/System/Library/Frameworks/CoreServices.framework/Frameworks/CarbonCore.framework/Headers/CarbonCore.h:20,
24                 from /Developer/SDKs/MacOSX10.4u.sdk/System/Library/Frameworks/CoreServices.framework/Headers/CoreServices.h:21,
25                 from /Developer/SDKs/MacOSX10.4u.sdk/System/Library/Frameworks/Carbon.framework/Headers/Carbon.h:20,
26                 from /Developer/SDKs/MacOSX10.4u.sdk/System/Library/Frameworks/QuickTime.framework/Headers/QuickTime.h:20,
27                 from demux_mov.c:42:
28/Developer/SDKs/MacOSX10.4u.sdk/System/Library/Frameworks/CoreFoundation.framework/Headers/CFString.h:697: error: parse error before '__attribute__'
29/Developer/SDKs/MacOSX10.4u.sdk/System/Library/Frameworks/CoreFoundation.framework/Headers/CFString.h:697: error: parse error before ')' token
30/Developer/SDKs/MacOSX10.4u.sdk/System/Library/Frameworks/CoreFoundation.framework/Headers/CFString.h:704: error: parse error before '__attribute__'
31/Developer/SDKs/MacOSX10.4u.sdk/System/Library/Frameworks/CoreFoundation.framework/Headers/CFString.h:704: error: parse error before ')' token
32/Developer/SDKs/MacOSX10.4u.sdk/System/Library/Frameworks/CoreFoundation.framework/Headers/CFString.h:714: error: parse error before '->' token
33/Developer/SDKs/MacOSX10.4u.sdk/System/Library/Frameworks/CoreFoundation.framework/Headers/CFString.h:714: error: conflicting types for 'CFStringGetCharacters'
34/Developer/SDKs/MacOSX10.4u.sdk/System/Library/Frameworks/CoreFoundation.framework/Headers/CFString.h:236: error: previous declaration of 'CFStringGetCharacters' was here
35/Developer/SDKs/MacOSX10.4u.sdk/System/Library/Frameworks/CoreFoundation.framework/Headers/CFString.h:714: error: parse error before '->' token
36In file included from /Developer/SDKs/MacOSX10.4u.sdk/System/Library/Frameworks/CoreFoundation.framework/Headers/CoreFoundation.h:66,
37                 from /Developer/SDKs/MacOSX10.4u.sdk/System/Library/Frameworks/CoreServices.framework/Frameworks/CarbonCore.framework/Headers/CarbonCore.h:20,
38                 from /Developer/SDKs/MacOSX10.4u.sdk/System/Library/Frameworks/CoreServices.framework/Headers/CoreServices.h:21,
39                 from /Developer/SDKs/MacOSX10.4u.sdk/System/Library/Frameworks/Carbon.framework/Headers/Carbon.h:20,
40                 from /Developer/SDKs/MacOSX10.4u.sdk/System/Library/Frameworks/QuickTime.framework/Headers/QuickTime.h:20,
41                 from demux_mov.c:42:
42/Developer/SDKs/MacOSX10.4u.sdk/System/Library/Frameworks/CoreFoundation.framework/Headers/CFByteOrder.h:28: error: parse error before '__attribute__'
43/Developer/SDKs/MacOSX10.4u.sdk/System/Library/Frameworks/CoreFoundation.framework/Headers/CFByteOrder.h:28: error: parse error before ')' token
44/Developer/SDKs/MacOSX10.4u.sdk/System/Library/Frameworks/CoreFoundation.framework/Headers/CFByteOrder.h:33: error: parse error before '__attribute__'
45/Developer/SDKs/MacOSX10.4u.sdk/System/Library/Frameworks/CoreFoundation.framework/Headers/CFByteOrder.h:33: error: parse error before ')' token
46/Developer/SDKs/MacOSX10.4u.sdk/System/Library/Frameworks/CoreFoundation.framework/Headers/CFByteOrder.h:48: error: parse error before '__attribute__'
47/Developer/SDKs/MacOSX10.4u.sdk/System/Library/Frameworks/CoreFoundation.framework/Headers/CFByteOrder.h:48: error: parse error before ')' token
48/Developer/SDKs/MacOSX10.4u.sdk/System/Library/Frameworks/CoreFoundation.framework/Headers/CFByteOrder.h:63: error: parse error before '__attribute__'
49/Developer/SDKs/MacOSX10.4u.sdk/System/Library/Frameworks/CoreFoundation.framework/Headers/CFByteOrder.h:63: error: parse error before ')' token
50/Developer/SDKs/MacOSX10.4u.sdk/System/Library/Frameworks/CoreFoundation.framework/Headers/CFByteOrder.h:67: error: parse error before '}' token
51/Developer/SDKs/MacOSX10.4u.sdk/System/Library/Frameworks/CoreFoundation.framework/Headers/CFByteOrder.h:68: error: parse error before '.' token
52/Developer/SDKs/MacOSX10.4u.sdk/System/Library/Frameworks/CoreFoundation.framework/Headers/CFByteOrder.h:74: error: parse error before '__attribute__'
53/Developer/SDKs/MacOSX10.4u.sdk/System/Library/Frameworks/CoreFoundation.framework/Headers/CFByteOrder.h:74: error: parse error before ')' token
54/Developer/SDKs/MacOSX10.4u.sdk/System/Library/Frameworks/CoreFoundation.framework/Headers/CFByteOrder.h:82: error: parse error before '__attribute__'
55/Developer/SDKs/MacOSX10.4u.sdk/System/Library/Frameworks/CoreFoundation.framework/Headers/CFByteOrder.h:82: error: parse error before ')' token
56/Developer/SDKs/MacOSX10.4u.sdk/System/Library/Frameworks/CoreFoundation.framework/Headers/CFByteOrder.h:90: error: parse error before '__attribute__'
57/Developer/SDKs/MacOSX10.4u.sdk/System/Library/Frameworks/CoreFoundation.framework/Headers/CFByteOrder.h:90: error: parse error before ')' token
58/Developer/SDKs/MacOSX10.4u.sdk/System/Library/Frameworks/CoreFoundation.framework/Headers/CFByteOrder.h:98: error: parse error before '__attribute__'
59/Developer/SDKs/MacOSX10.4u.sdk/System/Library/Frameworks/CoreFoundation.framework/Headers/CFByteOrder.h:98: error: parse error before ')' token
60/Developer/SDKs/MacOSX10.4u.sdk/System/Library/Frameworks/CoreFoundation.framework/Headers/CFByteOrder.h:106: error: parse error before '__attribute__'
61/Developer/SDKs/MacOSX10.4u.sdk/System/Library/Frameworks/CoreFoundation.framework/Headers/CFByteOrder.h:106: error: parse error before ')' token
62/Developer/SDKs/MacOSX10.4u.sdk/System/Library/Frameworks/CoreFoundation.framework/Headers/CFByteOrder.h:114: error: parse error before '__attribute__'
63/Developer/SDKs/MacOSX10.4u.sdk/System/Library/Frameworks/CoreFoundation.framework/Headers/CFByteOrder.h:114: error: parse error before ')' token
64/Developer/SDKs/MacOSX10.4u.sdk/System/Library/Frameworks/CoreFoundation.framework/Headers/CFByteOrder.h:122: error: parse error before '__attribute__'
65/Developer/SDKs/MacOSX10.4u.sdk/System/Library/Frameworks/CoreFoundation.framework/Headers/CFByteOrder.h:122: error: parse error before ')' token
66/Developer/SDKs/MacOSX10.4u.sdk/System/Library/Frameworks/CoreFoundation.framework/Headers/CFByteOrder.h:130: error: parse error before '__attribute__'
67/Developer/SDKs/MacOSX10.4u.sdk/System/Library/Frameworks/CoreFoundation.framework/Headers/CFByteOrder.h:130: error: parse error before ')' token
68/Developer/SDKs/MacOSX10.4u.sdk/System/Library/Frameworks/CoreFoundation.framework/Headers/CFByteOrder.h:138: error: parse error before '__attribute__'
69/Developer/SDKs/MacOSX10.4u.sdk/System/Library/Frameworks/CoreFoundation.framework/Headers/CFByteOrder.h:138: error: parse error before ')' token
70/Developer/SDKs/MacOSX10.4u.sdk/System/Library/Frameworks/CoreFoundation.framework/Headers/CFByteOrder.h:146: error: parse error before '__attribute__'
71/Developer/SDKs/MacOSX10.4u.sdk/System/Library/Frameworks/CoreFoundation.framework/Headers/CFByteOrder.h:146: error: parse error before ')' token
72/Developer/SDKs/MacOSX10.4u.sdk/System/Library/Frameworks/CoreFoundation.framework/Headers/CFByteOrder.h:154: error: parse error before '__attribute__'
73/Developer/SDKs/MacOSX10.4u.sdk/System/Library/Frameworks/CoreFoundation.framework/Headers/CFByteOrder.h:154: error: parse error before ')' token
74/Developer/SDKs/MacOSX10.4u.sdk/System/Library/Frameworks/CoreFoundation.framework/Headers/CFByteOrder.h:162: error: parse error before '__attribute__'
75/Developer/SDKs/MacOSX10.4u.sdk/System/Library/Frameworks/CoreFoundation.framework/Headers/CFByteOrder.h:162: error: parse error before ')' token
76/Developer/SDKs/MacOSX10.4u.sdk/System/Library/Frameworks/CoreFoundation.framework/Headers/CFByteOrder.h:173: error: parse error before '__attribute__'
77/Developer/SDKs/MacOSX10.4u.sdk/System/Library/Frameworks/CoreFoundation.framework/Headers/CFByteOrder.h:173: error: parse error before ')' token
78/Developer/SDKs/MacOSX10.4u.sdk/System/Library/Frameworks/CoreFoundation.framework/Headers/CFByteOrder.h:177: error: parse error before '}' token
79/Developer/SDKs/MacOSX10.4u.sdk/System/Library/Frameworks/CoreFoundation.framework/Headers/CFByteOrder.h:178: error: parse error before '.' token
80/Developer/SDKs/MacOSX10.4u.sdk/System/Library/Frameworks/CoreFoundation.framework/Headers/CFByteOrder.h:185: error: parse error before '__attribute__'
81/Developer/SDKs/MacOSX10.4u.sdk/System/Library/Frameworks/CoreFoundation.framework/Headers/CFByteOrder.h:185: error: parse error before ')' token
82/Developer/SDKs/MacOSX10.4u.sdk/System/Library/Frameworks/CoreFoundation.framework/Headers/CFByteOrder.h:189: error: parse error before '}' token
83/Developer/SDKs/MacOSX10.4u.sdk/System/Library/Frameworks/CoreFoundation.framework/Headers/CFByteOrder.h:190: error: parse error before '.' token
84/Developer/SDKs/MacOSX10.4u.sdk/System/Library/Frameworks/CoreFoundation.framework/Headers/CFByteOrder.h:197: error: parse error before '__attribute__'
85/Developer/SDKs/MacOSX10.4u.sdk/System/Library/Frameworks/CoreFoundation.framework/Headers/CFByteOrder.h:197: error: parse error before ')' token
86/Developer/SDKs/MacOSX10.4u.sdk/System/Library/Frameworks/CoreFoundation.framework/Headers/CFByteOrder.h:200: error: conflicting types for 'sv'
87/Developer/SDKs/MacOSX10.4u.sdk/System/Library/Frameworks/CoreFoundation.framework/Headers/CFByteOrder.h:188: error: previous declaration of 'sv' was here
88/Developer/SDKs/MacOSX10.4u.sdk/System/Library/Frameworks/CoreFoundation.framework/Headers/CFByteOrder.h:201: error: parse error before '}' token
89/Developer/SDKs/MacOSX10.4u.sdk/System/Library/Frameworks/CoreFoundation.framework/Headers/CFByteOrder.h:202: error: parse error before '.' token
90/Developer/SDKs/MacOSX10.4u.sdk/System/Library/Frameworks/CoreFoundation.framework/Headers/CFByteOrder.h:209: error: parse error before '__attribute__'
91/Developer/SDKs/MacOSX10.4u.sdk/System/Library/Frameworks/CoreFoundation.framework/Headers/CFByteOrder.h:209: error: parse error before ')' token
92/Developer/SDKs/MacOSX10.4u.sdk/System/Library/Frameworks/CoreFoundation.framework/Headers/CFByteOrder.h:212: error: conflicting types for 'sv'
93/Developer/SDKs/MacOSX10.4u.sdk/System/Library/Frameworks/CoreFoundation.framework/Headers/CFByteOrder.h:188: error: previous declaration of 'sv' was here
94/Developer/SDKs/MacOSX10.4u.sdk/System/Library/Frameworks/CoreFoundation.framework/Headers/CFByteOrder.h:213: error: parse error before '}' token
95/Developer/SDKs/MacOSX10.4u.sdk/System/Library/Frameworks/CoreFoundation.framework/Headers/CFByteOrder.h:214: error: parse error before '.' token
96/Developer/SDKs/MacOSX10.4u.sdk/System/Library/Frameworks/CoreFoundation.framework/Headers/CFByteOrder.h:221: error: parse error before '__attribute__'
97/Developer/SDKs/MacOSX10.4u.sdk/System/Library/Frameworks/CoreFoundation.framework/Headers/CFByteOrder.h:221: error: parse error before ')' token
98/Developer/SDKs/MacOSX10.4u.sdk/System/Library/Frameworks/CoreFoundation.framework/Headers/CFByteOrder.h:225: error: parse error before '}' token
99/Developer/SDKs/MacOSX10.4u.sdk/System/Library/Frameworks/CoreFoundation.framework/Headers/CFByteOrder.h:226: error: parse error before '.' token
100/Developer/SDKs/MacOSX10.4u.sdk/System/Library/Frameworks/CoreFoundation.framework/Headers/CFByteOrder.h:233: error: parse error before '__attribute__'
101/Developer/SDKs/MacOSX10.4u.sdk/System/Library/Frameworks/CoreFoundation.framework/Headers/CFByteOrder.h:233: error: parse error before ')' token
102/Developer/SDKs/MacOSX10.4u.sdk/System/Library/Frameworks/CoreFoundation.framework/Headers/CFByteOrder.h:237: error: parse error before '}' token
103/Developer/SDKs/MacOSX10.4u.sdk/System/Library/Frameworks/CoreFoundation.framework/Headers/CFByteOrder.h:238: error: parse error before '.' token
104/Developer/SDKs/MacOSX10.4u.sdk/System/Library/Frameworks/CoreFoundation.framework/Headers/CFByteOrder.h:245: error: parse error before '__attribute__'
105/Developer/SDKs/MacOSX10.4u.sdk/System/Library/Frameworks/CoreFoundation.framework/Headers/CFByteOrder.h:245: error: parse error before ')' token
106/Developer/SDKs/MacOSX10.4u.sdk/System/Library/Frameworks/CoreFoundation.framework/Headers/CFByteOrder.h:248: error: conflicting types for 'sv'
107/Developer/SDKs/MacOSX10.4u.sdk/System/Library/Frameworks/CoreFoundation.framework/Headers/CFByteOrder.h:236: error: previous declaration of 'sv' was here
108/Developer/SDKs/MacOSX10.4u.sdk/System/Library/Frameworks/CoreFoundation.framework/Headers/CFByteOrder.h:249: error: parse error before '}' token
109/Developer/SDKs/MacOSX10.4u.sdk/System/Library/Frameworks/CoreFoundation.framework/Headers/CFByteOrder.h:250: error: parse error before '.' token
110/Developer/SDKs/MacOSX10.4u.sdk/System/Library/Frameworks/CoreFoundation.framework/Headers/CFByteOrder.h:257: error: parse error before '__attribute__'
111/Developer/SDKs/MacOSX10.4u.sdk/System/Library/Frameworks/CoreFoundation.framework/Headers/CFByteOrder.h:257: error: parse error before ')' token
112/Developer/SDKs/MacOSX10.4u.sdk/System/Library/Frameworks/CoreFoundation.framework/Headers/CFByteOrder.h:260: error: conflicting types for 'sv'
113/Developer/SDKs/MacOSX10.4u.sdk/System/Library/Frameworks/CoreFoundation.framework/Headers/CFByteOrder.h:236: error: previous declaration of 'sv' was here
114/Developer/SDKs/MacOSX10.4u.sdk/System/Library/Frameworks/CoreFoundation.framework/Headers/CFByteOrder.h:261: error: parse error before '}' token
115/Developer/SDKs/MacOSX10.4u.sdk/System/Library/Frameworks/CoreFoundation.framework/Headers/CFByteOrder.h:262: error: parse error before '.' token
116In file included from /Developer/SDKs/MacOSX10.4u.sdk/System/Library/Frameworks/CoreFoundation.framework/Headers/CoreFoundation.h:84,
117                 from /Developer/SDKs/MacOSX10.4u.sdk/System/Library/Frameworks/CoreServices.framework/Frameworks/CarbonCore.framework/Headers/CarbonCore.h:20,
118                 from /Developer/SDKs/MacOSX10.4u.sdk/System/Library/Frameworks/CoreServices.framework/Headers/CoreServices.h:21,
119                 from /Developer/SDKs/MacOSX10.4u.sdk/System/Library/Frameworks/Carbon.framework/Headers/Carbon.h:20,
120                 from /Developer/SDKs/MacOSX10.4u.sdk/System/Library/Frameworks/QuickTime.framework/Headers/QuickTime.h:20,
121                 from demux_mov.c:42:
122/Developer/SDKs/MacOSX10.4u.sdk/System/Library/Frameworks/CoreFoundation.framework/Headers/CFUserNotification.h:122: error: parse error before '__attribute__'
123/Developer/SDKs/MacOSX10.4u.sdk/System/Library/Frameworks/CoreFoundation.framework/Headers/CFUserNotification.h:122: error: parse error before ')' token
124/Developer/SDKs/MacOSX10.4u.sdk/System/Library/Frameworks/CoreFoundation.framework/Headers/CFUserNotification.h:123: error: parse error before '__attribute__'
125/Developer/SDKs/MacOSX10.4u.sdk/System/Library/Frameworks/CoreFoundation.framework/Headers/CFUserNotification.h:123: error: parse error before ')' token
126/Developer/SDKs/MacOSX10.4u.sdk/System/Library/Frameworks/CoreFoundation.framework/Headers/CFUserNotification.h:124: error: parse error before '__attribute__'
127/Developer/SDKs/MacOSX10.4u.sdk/System/Library/Frameworks/CoreFoundation.framework/Headers/CFUserNotification.h:124: error: parse error before ')' token
128In file included from /Developer/SDKs/MacOSX10.4u.sdk/System/Library/Frameworks/CoreServices.framework/Frameworks/CFNetwork.framework/Headers/CFNetwork.h:29,
129                 from /Developer/SDKs/MacOSX10.4u.sdk/System/Library/Frameworks/CoreServices.framework/Headers/CoreServices.h:33,
130                 from /Developer/SDKs/MacOSX10.4u.sdk/System/Library/Frameworks/Carbon.framework/Headers/Carbon.h:20,
131                 from /Developer/SDKs/MacOSX10.4u.sdk/System/Library/Frameworks/QuickTime.framework/Headers/QuickTime.h:20,
132                 from demux_mov.c:42:
133/Developer/SDKs/MacOSX10.4u.sdk/System/Library/Frameworks/CoreServices.framework/Frameworks/CFNetwork.framework/Headers/CFSocketStream.h:228: error: parse error before '__attribute__'
134/Developer/SDKs/MacOSX10.4u.sdk/System/Library/Frameworks/CoreServices.framework/Frameworks/CFNetwork.framework/Headers/CFSocketStream.h:228: error: parse error before ')' token
135/Developer/SDKs/MacOSX10.4u.sdk/System/Library/Frameworks/CoreServices.framework/Frameworks/CFNetwork.framework/Headers/CFSocketStream.h:233: error: parse error before '__attribute__'
136/Developer/SDKs/MacOSX10.4u.sdk/System/Library/Frameworks/CoreServices.framework/Frameworks/CFNetwork.framework/Headers/CFSocketStream.h:233: error: parse error before ')' token
137demux_mov.c: In function 'lschunks':
138demux_mov.c:1411: warning: pointer targets in passing argument 2 of 'stream_read' differ in signedness
139demux_mov.c: In function 'lschunks_intrak':
140demux_mov.c:1598: warning: pointer targets in passing argument 2 of 'stream_read' differ in signedness
141demux_mov.c:1716: warning: pointer targets in passing argument 2 of 'stream_read' differ in signedness
142demux_mov.c: In function 'demux_mov_fill_buffer':
143demux_mov.c:2145: warning: pointer targets in passing argument 2 of 'stream_read' differ in signedness
144demux_mov.c:2187: warning: assignment from incompatible pointer type
145make[1]: *** [demux_mov.o] Error 1
146make: *** [libmpdemux/libmpdemux.a] Error 2